Reaction Details
TargetCarbonic anhydrase 7
LigandBDBM25907
Substrate/CompetitorBDBM10856
Meas. Tech.CA Inhibition Assay
Ki 62±n/a nM
Citation Güzel, OInnocenti, AScozzafava, ASalman, AParkkila, SHilvo, MSupuran, CT Carbonic anhydrase inhibitors: synthesis and inhibition studies against mammalian isoforms I-XV with a series of 2-(hydrazinocarbonyl)-3-substituted-phenyl-1H-indole-5-sulfonamides. Bioorg Med Chem16:9113-20 (2008) 
 
Carbonic anhydrase 7
Name:Carbonic anhydrase 7
Type:Enzyme
Mol. Mass.:29664.11
Organism:Homo sapiens (Human)
Description:Human cloned isozyme.
Residue:264
BDBM25907
BDBM10856
NameBDBM25907
Synonyms:2-(hydrazinecarbonyl)-3-(4-methylphenyl)-1H-indole-5-sulfonamide indole sulfonamide, 8c
TypeSmall organic molecule
Emp. Form.C16H16N4O3S
Mol. Mass.344.388
SMILESCc1ccc(cc1)-c1c([nH]c2ccc(cc12)S(N)(=O)=O)C(=O)NN