Reaction Details
TargetCarbonic anhydrase 9
LigandBDBM25906
Substrate/CompetitorBDBM10856
Meas. Tech.CA Inhibition Assay
Ki 77±n/a nM
Citation Güzel, OInnocenti, AScozzafava, ASalman, AParkkila, SHilvo, MSupuran, CT Carbonic anhydrase inhibitors: synthesis and inhibition studies against mammalian isoforms I-XV with a series of 2-(hydrazinocarbonyl)-3-substituted-phenyl-1H-indole-5-sulfonamides. Bioorg Med Chem16:9113-20 (2008) 
 
Carbonic anhydrase 9
Name:Carbonic anhydrase 9
Type:Enzyme
Mol. Mass.:49669.03
Organism:Homo sapiens (Human)
Description:Catalytic domain of human cloned isozyme was used in the assay
Residue:459
BDBM25906
BDBM10856
NameBDBM25906
Synonyms:2-(hydrazinecarbonyl)-3-(3-methylphenyl)-1H-indole-5-sulfonamide indole sulfonamide, 8b
TypeSmall organic molecule
Emp. Form.C16H16N4O3S
Mol. Mass.344.388
SMILESCc1cccc(c1)-c1c([nH]c2ccc(cc12)S(N)(=O)=O)C(=O)NN