Reaction Details
TargetCarbonic anhydrase 12
LigandBDBM25909
Substrate/CompetitorBDBM10856
Meas. Tech.CA Inhibition Assay
Ki 69±n/a nM
Citation Güzel, OInnocenti, AScozzafava, ASalman, AParkkila, SHilvo, MSupuran, CT Carbonic anhydrase inhibitors: synthesis and inhibition studies against mammalian isoforms I-XV with a series of 2-(hydrazinocarbonyl)-3-substituted-phenyl-1H-indole-5-sulfonamides. Bioorg Med Chem16:9113-20 (2008) 
 
Carbonic anhydrase 12
Name:Carbonic anhydrase 12
Type:Enzyme
Mol. Mass.:39456.00
Organism:Homo sapiens (Human)
Description:Catalytic domain of human cloned isozyme was used in the assay
Residue:354
BDBM25909
BDBM10856
NameBDBM25909
Synonyms:3-(3-fluorophenyl)-2-(hydrazinecarbonyl)-1H-indole-5-sulfonamide indole sulfonamide, 8e
TypeSmall organic molecule
Emp. Form.C15H13FN4O3S
Mol. Mass.348.352
SMILESNNC(=O)c1[nH]c2ccc(cc2c1-c1cccc(F)c1)S(N)(=O)=O