Reaction Details
TargetCarbonic anhydrase 13
LigandBDBM25915
Substrate/CompetitorBDBM10856
Meas. Tech.CA Inhibition Assay
Ki 867±n/a nM
Citation Güzel, OInnocenti, AScozzafava, ASalman, AParkkila, SHilvo, MSupuran, CT Carbonic anhydrase inhibitors: synthesis and inhibition studies against mammalian isoforms I-XV with a series of 2-(hydrazinocarbonyl)-3-substituted-phenyl-1H-indole-5-sulfonamides. Bioorg Med Chem16:9113-20 (2008) 
 
Carbonic anhydrase 13
Name:Carbonic anhydrase 13
Type:Enzyme
Mol. Mass.:29522.80
Organism:Mus musculus (mouse)
Description:Murine cloned isozyme
Residue:262
BDBM25915
BDBM10856
NameBDBM25915
Synonyms:3-(3-bromophenyl)-2-(hydrazinecarbonyl)-1H-indole-5-sulfonamide indole sulfonamide, 8k
TypeSmall organic molecule
Emp. Form.C15H13BrN4O3S
Mol. Mass.409.258
SMILESNNC(=O)c1[nH]c2ccc(cc2c1-c1cccc(Br)c1)S(N)(=O)=O