Reaction Details
TargetCarbonic anhydrase 15 [19-324]
LigandBDBM25910
Substrate/CompetitorBDBM10856
Meas. Tech.CA Inhibition Assay
Ki 49±n/a nM
Citation Güzel, OInnocenti, AScozzafava, ASalman, AParkkila, SHilvo, MSupuran, CT Carbonic anhydrase inhibitors: synthesis and inhibition studies against mammalian isoforms I-XV with a series of 2-(hydrazinocarbonyl)-3-substituted-phenyl-1H-indole-5-sulfonamides. Bioorg Med Chem16:9113-20 (2008) 
 
Carbonic anhydrase 15 [19-324]
Name:Carbonic anhydrase 15 [19-324]
Type:Enzyme
Mol. Mass.:33409.51
Organism:Mus musculus (mouse)
Description:Mouse cloned isozyme.
Residue:306
BDBM25910
BDBM10856
NameBDBM25910
Synonyms:3-(4-fluorophenyl)-2-(hydrazinecarbonyl)-1H-indole-5-sulfonamide indole sulfonamide, 8f
TypeSmall organic molecule
Emp. Form.C15H13FN4O3S
Mol. Mass.348.352
SMILESNNC(=O)c1[nH]c2ccc(cc2c1-c1ccc(F)cc1)S(N)(=O)=O