Reaction Details
TargetPhosphodiesterase
LigandBDBM384789
Substrate/Competitorn/a
Meas. Tech.PDE2 Assay B
Ki 0.110±n/a nM
Citation Shen, DWang, DQian, XHarper, BYang, MBo, Y Pyrimidinone amide compounds as PDE2 inhibitors US Patent US10285989 Publication Date 5/14/2019
 
Phosphodiesterase
Name:Phosphodiesterase
Type:Enzyme Catalytic Domain
Mol. Mass.:105547.91
Organism:Macaca mulatta (Rhesus macaque)
Description:n/a
Residue:941
BDBM384789
NameBDBM384789
Synonyms:US10285989, Example 2
TypeSmall organic molecule
Emp. Form.C15H14F3N3O4S
Mol. Mass.389.35
SMILESCC(NC(=O)c1cc(=O)[nH]c(n1)S(C)(=O)=O)c1ccc(cc1)C(F)(F)F