Reaction Details
TargetPhosphodiesterase
LigandBDBM384819
Substrate/Competitorn/a
Meas. Tech.PDE2 Assay B
Ki 0.120±n/a nM
Citation Shen, DWang, DQian, XHarper, BYang, MBo, Y Pyrimidinone amide compounds as PDE2 inhibitors US Patent US10285989 Publication Date 5/14/2019
 
Phosphodiesterase
Name:Phosphodiesterase
Type:Enzyme Catalytic Domain
Mol. Mass.:105547.91
Organism:Macaca mulatta (Rhesus macaque)
Description:n/a
Residue:941
BDBM384819
NameBDBM384819
Synonyms:N-[(1R)-1-(4-cyclopropylphenyl)-2,2- dimethylpropyl]-2-(dimelhylamino)-6- oxo-1,6-dihydropyrimidine-4- carboxamide | US10285989, Example 35
TypeSmall organic molecule
Emp. Form.C21H28N4O2
Mol. Mass.368.4726
SMILESCN(C)c1nc(cc(=O)[nH]1)C(=O)N[C@@H](c1ccc(cc1)C1CC1)C(C)(C)C