Reaction Details
TargetPhosphodiesterase
LigandBDBM384842
Substrate/Competitorn/a
Meas. Tech.PDE2 Assay B
Ki 0.100±n/a nM
Citation Shen, DWang, DQian, XHarper, BYang, MBo, Y Pyrimidinone amide compounds as PDE2 inhibitors US Patent US10285989 Publication Date 5/14/2019
 
Phosphodiesterase
Name:Phosphodiesterase
Type:Enzyme Catalytic Domain
Mol. Mass.:105547.91
Organism:Macaca mulatta (Rhesus macaque)
Description:n/a
Residue:941
BDBM384842
NameBDBM384842
Synonyms:N-[(1R)-1-(4-cyclopropyl-3- fluorophenyl)-2,2-dimethylpropyl]-2- (dimethylamino)-6-oxo-1,6- dihydropyrimidine-4-carboxamide | US10285989, Example 58
TypeSmall organic molecule
Emp. Form.C21H27FN4O2
Mol. Mass.386.4631
SMILESCN(C)c1nc(cc(=O)[nH]1)C(=O)N[C@@H](c1ccc(C2CC2)c(F)c1)C(C)(C)C