Reaction Details
TargetPhosphodiesterase
LigandBDBM384884
Substrate/Competitorn/a
Meas. Tech.PDE2 Assay B
Ki 0.170±n/a nM
Citation Shen, DWang, DQian, XHarper, BYang, MBo, Y Pyrimidinone amide compounds as PDE2 inhibitors US Patent US10285989 Publication Date 5/14/2019
 
Phosphodiesterase
Name:Phosphodiesterase
Type:Enzyme Catalytic Domain
Mol. Mass.:105547.91
Organism:Macaca mulatta (Rhesus macaque)
Description:n/a
Residue:941
BDBM384884
NameBDBM384884
Synonyms:2-(dimethylamino)-N-{(1R)-2,2- dimethyl-1-[4- (trifluoromethoxy)phenyl]propyl}-6-oxo- 1,6-dihydropyrimidine-4-carboxamide | US10285989, Example 100
TypeSmall organic molecule
Emp. Form.C19H23F3N4O3
Mol. Mass.412.4061
SMILESCN(C)c1nc(cc(=O)[nH]1)C(=O)N[C@@H](c1ccc(OC(F)(F)F)cc1)C(C)(C)C