Reaction Details
TargetPhosphodiesterase
LigandBDBM384928
Substrate/Competitorn/a
Meas. Tech.PDE2 Assay B
Ki 0.150±n/a nM
Citation Shen, DWang, DQian, XHarper, BYang, MBo, Y Pyrimidinone amide compounds as PDE2 inhibitors US Patent US10285989 Publication Date 5/14/2019
 
Phosphodiesterase
Name:Phosphodiesterase
Type:Enzyme Catalytic Domain
Mol. Mass.:105547.91
Organism:Macaca mulatta (Rhesus macaque)
Description:n/a
Residue:941
BDBM384928
NameBDBM384928
Synonyms:N-[(1R)-2- methyl-1-{4- [(trifluoromethyl) sulfanyl]phenyl} propyl]-6-oxo-2- pyrrolidin-1-yl-1,6- dihydropyrimidine- 4-carboxamide | US10285989, Example 147
TypeSmall organic molecule
Emp. Form.C20H23F3N4O2S
Mol. Mass.440.482
SMILESCC(C)[C@@H](NC(=O)c1cc(=O)[nH]c(n1)N1CCCC1)c1ccc(SC(F)(F)F)cc1