Reaction Details
TargetMu-type opioid receptor
LigandBDBM179897
Substrate/Competitorn/a
Meas. Tech.Opioid Receptor Binding Assay
Ki 0.083±n/a nM
Citation Blumberg, LCDeaver, DREyerman, DJWynn, TA Morphan and morphinan analogues, and methods of use US Patent US10287250 Publication Date 5/14/2019
 
Mu-type opioid receptor
Name:Mu-type opioid receptor
Type:G Protein-Coupled Receptor (GPCR)
Mol. Mass.:44789.51
Organism:Homo sapiens (Human)
Description:P35372
Residue:400
BDBM179897
NameBDBM179897
Synonyms:US10287250, Compound 1 US10752592, Compound TABLE D.1 US9133125, Table D, Compound 1 | US9656961, Example 00165
TypeSmall organic molecule
Emp. Form.C22H30N2O
Mol. Mass.338.4864
SMILESC[C@H](C1CC1)N1CC[C@]23CCCC[C@H]2[C@H]1Cc1ccc(cc31)C(N)=O