Reaction Details
TargetEpidermal growth factor receptor [696-1022,T790M,L858R]
LigandBDBM26105
Substrate/CompetitorBDBM10852
Meas. Tech.Fluorescence Binding Assay
pH7.4±n/a
Temperature295.15±n/a K
Kd 18.6±.5 nM
Citation Yun, CHMengwasser, KEToms, AVWoo, MSGreulich, HWong, KKMeyerson, MEck, MJ The T790M mutation in EGFR kinase causes drug resistance by increasing the affinity for ATP. Proc Natl Acad Sci U S A105:2070-5 (2008) 
 
Epidermal growth factor receptor [696-1022,T790M,L858R]
Name:Epidermal growth factor receptor [696-1022,T790M,L858R]
Type:Tyrosine-protein kinase
Mol. Mass.:37326.85
Organism:Homo sapiens (Human)
Description:P00533[696-1022,T790M,L858R]
Residue:327
BDBM26105
BDBM10852
NameBDBM26105
Synonyms:6-{4-[(4-ethylpiperazin-1-yl)methyl]phenyl}-N-[(1R)-1-phenylethyl]-7H-pyrrolo[2,3-d]pyrimidin-4-amine | AEE788
TypeSmall organic molecule
Emp. Form.C27H32N6
Mol. Mass.440.5832
SMILESCCN1CCN(Cc2ccc(cc2)-c2cc3c(N[C@H](C)c4ccccc4)ncnc3[nH]2)CC1