Reaction Details
TargetCarbonic anhydrase 4
LigandBDBM26195
Substrate/CompetitorBDBM10856
Meas. Tech.CA Inhibition Assay
Ki 743000±n/a nM
Citation Innocenti, AVullo, DScozzafava, ASupuran, CT Carbonic anhydrase inhibitors: inhibition of mammalian isoforms I-XIV with a series of substituted phenols including paracetamol and salicylic acid. Bioorg Med Chem16:7424-8 (2008) 
 
Carbonic anhydrase 4
Name:Carbonic anhydrase 4
Type:Enzyme
Mol. Mass.:35037.98
Organism:Homo sapiens (Human)
Description:P22748
Residue:312
BDBM26195
BDBM10856
NameBDBM26195
Synonyms:4-aminophenol | phenol derivative, 9
TypeSmall organic molecule
Emp. Form.C6H7NO
Mol. Mass.109.1259
SMILESNc1ccc(O)cc1