Reaction Details
TargetCarbonic anhydrase 7
LigandBDBM26189
Substrate/CompetitorBDBM10856
Meas. Tech.CA Inhibition Assay
Ki 644000±n/a nM
Citation Innocenti, AVullo, DScozzafava, ASupuran, CT Carbonic anhydrase inhibitors: inhibition of mammalian isoforms I-XIV with a series of substituted phenols including paracetamol and salicylic acid. Bioorg Med Chem16:7424-8 (2008) 
 
Carbonic anhydrase 7
Name:Carbonic anhydrase 7
Type:Enzyme
Mol. Mass.:29664.11
Organism:Homo sapiens (Human)
Description:Human cloned isozyme.
Residue:264
BDBM26189
BDBM10856
NameBDBM26189
Synonyms:α-CA inhibitor, 13 1,3-dihydroxybenzene US9688816, 4 phenol derivative, 3
TypeSmall organic molecule
Emp. Form.C6H6O2
Mol. Mass.110.1106
SMILESOc1cccc(O)c1