Reaction Details
TargetCarbonic anhydrase 9
LigandBDBM26196
Substrate/CompetitorBDBM10856
Meas. Tech.CA Inhibition Assay
Ki 56000±n/a nM
Citation Innocenti, AVullo, DScozzafava, ASupuran, CT Carbonic anhydrase inhibitors: inhibition of mammalian isoforms I-XIV with a series of substituted phenols including paracetamol and salicylic acid. Bioorg Med Chem16:7424-8 (2008) 
 
Carbonic anhydrase 9
Name:Carbonic anhydrase 9
Type:Enzyme
Mol. Mass.:49669.03
Organism:Homo sapiens (Human)
Description:Catalytic domain of human cloned isozyme was used in the assay
Residue:459
BDBM26196
BDBM10856
NameBDBM26196
Synonyms:4-cyanophenol phenol derivative, 10
TypeSmall organic molecule
Emp. Form.C7H5NO
Mol. Mass.119.1207
SMILESOc1ccc(cc1)C#N