Reaction Details
TargetCarbonic anhydrase 13
LigandBDBM26187
Substrate/CompetitorBDBM10856
Meas. Tech.CA Inhibition Assay
Ki 697000±n/a nM
Citation Innocenti, AVullo, DScozzafava, ASupuran, CT Carbonic anhydrase inhibitors: inhibition of mammalian isoforms I-XIV with a series of substituted phenols including paracetamol and salicylic acid. Bioorg Med Chem16:7424-8 (2008) 
 
Carbonic anhydrase 13
Name:Carbonic anhydrase 13
Type:Enzyme
Mol. Mass.:29522.80
Organism:Mus musculus (mouse)
Description:Murine cloned isozyme
Residue:262
BDBM26187
BDBM10856
NameBDBM26187
Synonyms:α-CA inhibitor, 11 US9688816, 2 | phenol
TypeSmall organic molecule
Emp. Form.C6H6O
Mol. Mass.94.1112
SMILESOc1ccccc1