Reaction Details
TargetGlutaminase kidney isoform, mitochondrial
LigandBDBM108891
Substrate/Competitorn/a
Meas. Tech.Recombinant Enzyme Assay
IC50 3.00±n/a nM
Citation Li, JChen, LGoyal, BLaidig, GStanton, TFSjogren, EB Heterocyclic inhibitors of glutaminase US Patent US9938267 Publication Date 4/10/2018
 
Glutaminase kidney isoform, mitochondrial
Name:Glutaminase kidney isoform, mitochondrial
Type:Protein
Mol. Mass.:73471.89
Organism:Homo sapiens (Human)
Description:O94925
Residue:669
BDBM108891
NameBDBM108891
Synonyms:US8604016, 471 | US9938267, Cmpd ID 471
TypeSmall organic molecule
Emp. Form.C33H39N7O3S
Mol. Mass.613.773
SMILESCC(C)(C)CNC(=O)Cc1cccc(CC(=O)Nc2nnc(CCCCc3ccc(NC(=O)Cc4ccccc4)nn3)s2)c1