Reaction Details
TargetCoagulation factor X
LigandBDBM387058
Substrate/Competitorn/a
Meas. Tech.In Vitro Assay
Ki 30±n/a nM
Citation Ding, ZLai, GChen, SYan, X Hydrazine compound as blood coagulation factor Xa inhibitor US Patent US9938272 Publication Date 4/10/2018
 
Coagulation factor X
Name:Coagulation factor X
Type:Enzyme
Mol. Mass.:54255.03
Organism:Rattus norvegicus (rat)
Description:n/a
Residue:482
BDBM387058
NameBDBM387058
Synonyms:1-(4-Methoxyphenyl)-7-oxo-6-(1-(3-oxomorpholino)piperidin-4-yl)-4,5,6,7-tetrahydro-1H-pyrazolo[3,4-c]pyridine-3-carboxamide | US9938272, Example 7
TypeSmall organic molecule
Emp. Form.C23H28N6O5
Mol. Mass.468.5056
SMILESCOc1ccc(cc1)-n1nc(C(N)=O)c2CCN(C3CCN(CC3)N3CCOCC3=O)C(=O)c12