Reaction Details
TargetPlasma kallikrein
LigandBDBM263228
Substrate/Competitorn/a
Meas. Tech.Inhibitory Activity Assay
IC50 4.62±0 nM
Citation Davie, RLEdwards, HJEvans, DMHodgson, STMiller, INovak, ARSmith, AJStocks, MJ Heterocyclic derivates US Patent US9533987 Publication Date 1/3/2017
 
Plasma kallikrein
Name:Plasma kallikrein
Type:Protein
Mol. Mass.:71391.16
Organism:Homo sapiens (Human)
Description:P03952
Residue:638
BDBM263228
NameBDBM263228
Synonyms:3-cyclobutyl-1-[4-(4-methyl-pyrazol-1-ylmethyl)-benzyl]-1h-pyrazole-4-carboxylic acid (1-amino-isoquinolin-6-ylmethyl)-amide | US9533987, example 14
TypeSmall organic molecule
Emp. Form.C30H31N7O
Mol. Mass.505.6134
SMILESCc1cnn(Cc2ccc(Cn3cc(C(=O)NCc4ccc5c(N)nccc5c4)c(n3)C3CCC3)cc2)c1