Reaction Details
TargetPlasma kallikrein
LigandBDBM263235
Substrate/Competitorn/a
Meas. Tech.Inhibitory Activity Assay
IC50 0.89±0 nM
Citation Davie, RLEdwards, HJEvans, DMHodgson, STMiller, INovak, ARSmith, AJStocks, MJ Heterocyclic derivates US Patent US9533987 Publication Date 1/3/2017
 
Plasma kallikrein
Name:Plasma kallikrein
Type:Protein
Mol. Mass.:71391.16
Organism:Homo sapiens (Human)
Description:P03952
Residue:638
BDBM263235
NameBDBM263235
Synonyms:3-(3,5-dimethyl-isoxazol-4-yl)-1-[4-(4-methyl-pyrazol-1-ylmethyl)-benzyl]-1h-pyrazole-4-carboxylic acid (1-amino-isoquinolin-6-ylmethyl)-amide | US9533987, example 20
TypeSmall organic molecule
Emp. Form.C31H30N8O2
Mol. Mass.546.6223
SMILESCc1cnn(Cc2ccc(Cn3cc(C(=O)NCc4ccc5c(N)nccc5c4)c(n3)-c3c(C)noc3C)cc2)c1