Reaction Details
TargetPlasma kallikrein
LigandBDBM263238
Substrate/Competitorn/a
Meas. Tech.Inhibitory Activity Assay
IC50 0.33±0 nM
Citation Davie, RLEdwards, HJEvans, DMHodgson, STMiller, INovak, ARSmith, AJStocks, MJ Heterocyclic derivates US Patent US9533987 Publication Date 1/3/2017
 
Plasma kallikrein
Name:Plasma kallikrein
Type:Protein
Mol. Mass.:71391.16
Organism:Homo sapiens (Human)
Description:P03952
Residue:638
BDBM263238
NameBDBM263238
Synonyms:5-amino-1-(4-pyrazol-1-ylmethyl-benzyl)-1h-pyrazole-4-carboxylic acid (1-amino-isoquinolin-6-ylmethyl)-amide | US9533987, example 23
TypeSmall organic molecule
Emp. Form.C25H24N8O
Mol. Mass.452.5111
SMILESNc1nn(Cc2ccc(Cn3cccn3)cc2)cc1C(=O)NCc1ccc2c(N)nccc2c1