Reaction Details
TargetPlasma kallikrein
LigandBDBM263259
Substrate/Competitorn/a
Meas. Tech.Inhibitory Activity Assay
IC50 1.27±0 nM
Citation Davie, RLEdwards, HJEvans, DMHodgson, STMiller, INovak, ARSmith, AJStocks, MJ Heterocyclic derivates US Patent US9533987 Publication Date 1/3/2017
 
Plasma kallikrein
Name:Plasma kallikrein
Type:Protein
Mol. Mass.:71391.16
Organism:Homo sapiens (Human)
Description:P03952
Residue:638
BDBM263259
NameBDBM263259
Synonyms:3-methoxymethyl-1-[4-(4-methyl-pyrazol-1-ylmethyl)-benzyl]-1h-pyrazole-4-carboxylic acid (1-amino-isoquinolin-6-ylmethyl)-amide | US9533987, example 38
TypeSmall organic molecule
Emp. Form.C28H29N7O2
Mol. Mass.495.5756
SMILESCOCc1nn(Cc2ccc(Cn3cc(C)cn3)cc2)cc1C(=O)NCc1ccc2c(N)nccc2c1