Reaction Details
TargetPlasma kallikrein
LigandBDBM263282
Substrate/Competitorn/a
Meas. Tech.Inhibitory Activity Assay
IC50 9.61±0 nM
Citation Davie, RLEdwards, HJEvans, DMHodgson, STMiller, INovak, ARSmith, AJStocks, MJ Heterocyclic derivates US Patent US9533987 Publication Date 1/3/2017
 
Plasma kallikrein
Name:Plasma kallikrein
Type:Protein
Mol. Mass.:71391.16
Organism:Homo sapiens (Human)
Description:P03952
Residue:638
BDBM263282
NameBDBM263282
Synonyms:1-[6-((s)-3-fluoro-pyrrolidin-1-yl)-pyridin-3-ylmethyl]-3-trifluoromethyl-1h-pyrazole-4-carboxylic acid (1-amino-isoquinolin-6-ylmethyl)-amide | US9533987, example 60
TypeSmall organic molecule
Emp. Form.C25H23F4N7O
Mol. Mass.513.49
SMILESNc1nccc2cc(CNC(=O)c3cn(Cc4ccc(nc4)N4CC[C@H](F)C4)nc3C(F)(F)F)ccc12