Reaction Details
TargetTumor necrosis factor
LigandBDBM77015
Substrate/Competitorn/a
Meas. Tech.cytomteric bead array (CBA) assay
Temperature310.15±n/a K
IC50 9.50±n/a nM
Commentsextracted
Citation Gandhi, ADimartino, JChopra, R Methods for the treatment of locally advanced breast cancer US Patent US9694015 Publication Date 7/4/2017
 
Tumor necrosis factor
Name:Tumor necrosis factor
Type:Enzyme
Mol. Mass.:25645.11
Organism:Homo sapiens (Human)
Description:P01375
Residue:233
BDBM77015
NameBDBM77015
Synonyms:(R)-3-(4-((4-(morpholinomethyl)benzyl)-oxy)-1-oxoisoindolin-2-yl)piperidine-2,6-dione | US9694015, 6.4R
TypeSmall organic molecule
Emp. Form.C25H27N3O5
Mol. Mass.449.499
SMILESO=C1N(Cc2c1cccc2OCc1ccc(CN2CCOCC2)cc1)[C@@H]1CCC(=O)NC1=O