Reaction Details
TargetC-C motif chemokine 4
LigandBDBM65456
Substrate/Competitorn/a
Meas. Tech.cytomteric bead array (CBA) assay
Temperature310.15±n/a K
IC50>10000±n/a nM
Commentsextracted
Citation Gandhi, ADimartino, JChopra, R Methods for the treatment of locally advanced breast cancer US Patent US9694015 Publication Date 7/4/2017
 
C-C motif chemokine 4
Name:C-C motif chemokine 4
Type:Protein
Mol. Mass.:10210.74
Organism:Homo sapiens (Human)
Description:P13236
Residue:92
BDBM65456
NameBDBM65456
Synonyms:19171-19-8 Actimid Pomalyst US20230271966, Compound Pomalidomide pomalidomide
TypeSmall organic molecule
Emp. Form.C13H11N3O4
Mol. Mass.273.2441
SMILESNc1cccc2C(=O)N(C3CCC(=O)NC3=O)C(=O)c12