Reaction Details
TargetTyrosine-protein kinase Fgr
LigandBDBM50184786
Substrate/Competitorn/a
Meas. Tech.Kinase Screening Assay
IC50<10.00±n/a nM
Citation Unciti-Broceta, AFraser, CO. Carragher, N Compounds US Patent US10294227 Publication Date 5/21/2019
 
Tyrosine-protein kinase Fgr
Name:Tyrosine-protein kinase Fgr
Type:protein
Mol. Mass.:59469.88
Organism:Homo sapiens (Human)
Description:P09769
Residue:529
BDBM50184786
NameBDBM50184786
Synonyms:CHEMBL3824116 | US10294227, Code 565
TypeSmall organic molecule
Emp. Form.C27H39N7O3
Mol. Mass.509.6437
SMILESCOc1cc(ccc1CC(=O)OC(C)(C)C)-c1nn(CCN2CCC(CC2)N(C)C)c2ncnc(N)c12