Reaction Details
TargetTyrosine-protein kinase Fgr
LigandBDBM387854
Substrate/Competitorn/a
Meas. Tech.Kinase Screening Assay
IC50<10.00±n/a nM
Citation Unciti-Broceta, AFraser, CO. Carragher, N Compounds US Patent US10294227 Publication Date 5/21/2019
 
Tyrosine-protein kinase Fgr
Name:Tyrosine-protein kinase Fgr
Type:protein
Mol. Mass.:59469.88
Organism:Homo sapiens (Human)
Description:P09769
Residue:529
BDBM387854
NameBDBM387854
Synonyms:US10294227, Code 584
TypeSmall organic molecule
Emp. Form.C26H34N8O2
Mol. Mass.490.6006
SMILESCOc1cc(ccc1Cc1ncc(C)o1)-c1nn(CCN2CCC(CC2)N(C)C)c2ncnc(N)c12