Reaction Details
TargetTyrosine-protein kinase Fgr
LigandBDBM387836
Substrate/Competitorn/a
Meas. Tech.Kinase Screening Assay
IC50<10.00±n/a nM
Citation Unciti-Broceta, AFraser, CO. Carragher, N Compounds US Patent US10294227 Publication Date 5/21/2019
 
Tyrosine-protein kinase Fgr
Name:Tyrosine-protein kinase Fgr
Type:protein
Mol. Mass.:59469.88
Organism:Homo sapiens (Human)
Description:P09769
Residue:529
BDBM387836
NameBDBM387836
Synonyms:US10294227, Code 585 | tert-butyl N-[4-[4-amino-1-[2-(4-methoxy-1-piperidyl)ethyl]pyrazolo[3,4-d]pyrimidin-3-yl]-2-methoxy-phenyl]carbamate (593)
TypeSmall organic molecule
Emp. Form.C25H35N7O4
Mol. Mass.497.5899
SMILESCOC1CCN(CCn2nc(-c3ccc(NC(=O)OC(C)(C)C)c(OC)c3)c3c(N)ncnc23)CC1