Reaction Details
TargetTyrosine-protein kinase FRK
LigandBDBM50184785
Substrate/Competitorn/a
Meas. Tech.Kinase Screening Assay
IC50 55.0±n/a nM
Citation Unciti-Broceta, AFraser, CO. Carragher, N Compounds US Patent US10294227 Publication Date 5/21/2019
 
Tyrosine-protein kinase FRK
Name:Tyrosine-protein kinase FRK
Type:Tyrosine-protein kinase
Mol. Mass.:58254.41
Organism:Homo sapiens (Human)
Description:P42685
Residue:505
BDBM50184785
NameBDBM50184785
Synonyms:CHEMBL3823620 | US10294227, Code 553
TypeSmall organic molecule
Emp. Form.C26H37N7O2
Mol. Mass.479.6177
SMILESCN(C)C1CCN(CCn2nc(-c3ccc(CC(=O)OC(C)(C)C)cc3)c3c(N)ncnc23)CC1