Reaction Details
TargetTyrosine-protein kinase FRK
LigandBDBM50184767
Substrate/Competitorn/a
Meas. Tech.Kinase Screening Assay
IC50<10.00±n/a nM
Citation Unciti-Broceta, AFraser, CO. Carragher, N Compounds US Patent US10294227 Publication Date 5/21/2019
 
Tyrosine-protein kinase FRK
Name:Tyrosine-protein kinase FRK
Type:Tyrosine-protein kinase
Mol. Mass.:58254.41
Organism:Homo sapiens (Human)
Description:P42685
Residue:505
BDBM50184767
NameBDBM50184767
Synonyms:CHEMBL3824089 | US10294227, Code 506
TypeSmall organic molecule
Emp. Form.C26H38N8O3
Mol. Mass.510.6317
SMILESCOc1cc(ccc1NC(=O)OC(C)(C)C)-c1nn(CCN2CCC(CC2)N(C)C)c2ncnc(N)c12