Reaction Details
TargetTyrosine-protein kinase FRK
LigandBDBM50184778
Substrate/Competitorn/a
Meas. Tech.Kinase Screening Assay
IC50>1000±n/a nM
Citation Unciti-Broceta, AFraser, CO. Carragher, N Compounds US Patent US10294227 Publication Date 5/21/2019
 
Tyrosine-protein kinase FRK
Name:Tyrosine-protein kinase FRK
Type:Tyrosine-protein kinase
Mol. Mass.:58254.41
Organism:Homo sapiens (Human)
Description:P42685
Residue:505
BDBM50184778
NameBDBM50184778
Synonyms:CHEMBL3823711 | US10294227, Code 540
TypeSmall organic molecule
Emp. Form.C26H39N9O2
Mol. Mass.509.647
SMILESCOc1cc(ccc1NC(=O)NC(C)(C)C)-c1nn(CCN2CCC(CC2)N(C)C)c2ncnc(N)c12