Reaction Details
TargetTyrosine-protein kinase Fyn
LigandBDBM387845
Substrate/Competitorn/a
Meas. Tech.Kinase Screening Assay
IC50 55.0±n/a nM
Citation Unciti-Broceta, AFraser, CO. Carragher, N Compounds US Patent US10294227 Publication Date 5/21/2019
 
Tyrosine-protein kinase Fyn
Name:Tyrosine-protein kinase Fyn
Type:Enzyme
Mol. Mass.:60762.21
Organism:Homo sapiens (Human)
Description:P06241
Residue:537
BDBM387845
NameBDBM387845
Synonyms:US10294227, Code 402
TypeSmall organic molecule
Emp. Form.C21H27N9
Mol. Mass.405.4994
SMILESCN(C)C1CCN(CCn2nc(-c3cnc4[nH]ccc4c3)c3c(N)ncnc23)CC1