Reaction Details
TargetTyrosine-protein kinase Fyn
LigandBDBM50184776
Substrate/Competitorn/a
Meas. Tech.Kinase Screening Assay
IC50<10.00±n/a nM
Citation Unciti-Broceta, AFraser, CO. Carragher, N Compounds US Patent US10294227 Publication Date 5/21/2019
 
Tyrosine-protein kinase Fyn
Name:Tyrosine-protein kinase Fyn
Type:Enzyme
Mol. Mass.:60762.21
Organism:Homo sapiens (Human)
Description:P06241
Residue:537
BDBM50184776
NameBDBM50184776
Synonyms:CHEMBL3824233 | US10294227, Code 518
TypeSmall organic molecule
Emp. Form.C28H40N8O3
Mol. Mass.536.669
SMILESCOc1cc(ccc1NC(=O)OC(C)(C)C)-c1nn(CCN2CCC(CC2)N2CCCC2)c2ncnc(N)c12