Reaction Details
TargetCarbonic anhydrase 1
LigandBDBM26998
Substrate/CompetitorBDBM10856
Meas. Tech.CA Inhibition Assay
pH7.5±n/a
Temperature293.15±n/a K
Ki 345±n/a nM
Citation Temperini, CCecchi, AScozzafava, ASupuran, CT Carbonic anhydrase inhibitors. Comparison of chlorthalidone, indapamide, trichloromethiazide, and furosemide X-ray crystal structures in adducts with isozyme II, when several water molecules make the difference. Bioorg Med Chem17:1214-21 (2009) 
 
Carbonic anhydrase 1
Name:Carbonic anhydrase 1
Type:Enzyme
Mol. Mass.:28873.37
Organism:Homo sapiens (Human)
Description:P00915
Residue:261
BDBM26998
BDBM10856
NameBDBM26998
Synonyms:6-chloro-3-(dichloromethyl)-1,1-dioxo-3,4-dihydro-2H-1,2,4-benzothiadiazine-7-sulfonamide trichloromethiazide, 6
TypeSmall organic molecule
Emp. Form.C8H8Cl3N3O4S2
Mol. Mass.380.656
SMILESNS(=O)(=O)c1cc2c(NC(NS2(=O)=O)C(Cl)Cl)cc1Cl