Reaction Details
TargetCarbonic anhydrase 15 [19-324]
LigandBDBM10879
Substrate/CompetitorBDBM10856
Meas. Tech.CA Inhibition Assay
pH7.5±n/a
Temperature293.15±n/a K
Ki 6895±n/a nM
Citation Hilvo, MSalzano, AMInnocenti, AKulomaa, MSScozzafava, AScaloni, AParkkila, SSupuran, CT Cloning, expression, post-translational modifications and inhibition studies on the latest mammalian carbonic anhydrase isoform, CA XV. J Med Chem52:646-54 (2009) 
 
Carbonic anhydrase 15 [19-324]
Name:Carbonic anhydrase 15 [19-324]
Type:Enzyme
Mol. Mass.:33409.51
Organism:Mus musculus (mouse)
Description:Mouse cloned isozyme.
Residue:306
BDBM10879
BDBM10856
NameBDBM10879
Synonyms:2-Hydrazinobenzenesulfonamide CHEMBL176495 hydrazide deriv. 18
TypeSmall organic molecule
Emp. Form.C6H9N3O2S
Mol. Mass.187.22
SMILESNNc1ccccc1S(N)(=O)=O