Reaction Details
TargetPoly [ADP-ribose] polymerase 1
LigandBDBM27139
Substrate/CompetitorBDBM27089
Meas. Tech.In Vitro PARP Enzyme Assay
pH8±n/a
Temperature295.15±n/a K
Ki 4±n/a nM
Citation Penning, TDZhu, GDGandhi, VBGong, JLiu, XShi, YKlinghofer, VJohnson, EFDonawho, CKFrost, DJBontcheva-Diaz, VBouska, JJOsterling, DJOlson, AMMarsh, KCLuo, YGiranda, VL Discovery of the Poly(ADP-ribose) polymerase (PARP) inhibitor 2-[(R)-2-methylpyrrolidin-2-yl]-1H-benzimidazole-4-carboxamide (ABT-888) for the treatment of cancer. J Med Chem52:514-23 (2009) 
 
Poly [ADP-ribose] polymerase 1
Name:Poly [ADP-ribose] polymerase 1
Type:n/a
Mol. Mass.:113114.22
Organism:Homo sapiens (Human)
Description:P09874
Residue:1014
BDBM27139
BDBM27089
NameBDBM27139
Synonyms:2-(3-methylpyrrolidin-3-yl)-1H-1,3-benzodiazole-4-carboxamide | benzimidazole carboxamide, 6a
TypeSmall organic molecule
Emp. Form.C13H16N4O
Mol. Mass.244.2923
SMILESCC1(CCNC1)c1nc2cccc(C(N)=O)c2[nH]1