Reaction Details
TargetPoly [ADP-ribose] polymerase 1
LigandBDBM27161
Substrate/CompetitorBDBM27089
Meas. Tech.In Vitro PARP Enzyme Assay
Ki 4±n/a nM
Citation Penning, TDZhu, GDGandhi, VBGong, JLiu, XShi, YKlinghofer, VJohnson, EFDonawho, CKFrost, DJBontcheva-Diaz, VBouska, JJOsterling, DJOlson, AMMarsh, KCLuo, YGiranda, VL Discovery of the Poly(ADP-ribose) polymerase (PARP) inhibitor 2-[(R)-2-methylpyrrolidin-2-yl]-1H-benzimidazole-4-carboxamide (ABT-888) for the treatment of cancer. J Med Chem52:514-23 (2009) 
 
Poly [ADP-ribose] polymerase 1
Name:Poly [ADP-ribose] polymerase 1
Type:n/a
Mol. Mass.:113114.22
Organism:Homo sapiens (Human)
Description:P09874
Residue:1014
BDBM27161
BDBM27089
NameBDBM27161
Synonyms:2-(4-methylpiperidin-4-yl)-1H-1,3-benzodiazole-4-carboxamide | benzimidazole carboxamide, 26
TypeSmall organic molecule
Emp. Form.C14H18N4O
Mol. Mass.258.3189
SMILESCC1(CCNCC1)c1nc2cccc(C(N)=O)c2[nH]1