Reaction Details
TargetReceptor-type tyrosine-protein kinase FLT3
LigandBDBM389575
Substrate/Competitorn/a
Meas. Tech.Biochemical Activity Assay
IC50 2124±n/a nM
Citation Baska, FKéri, GOrfi, LBánhegyi, PKékesi, LZsákai, LSipos, ASzántai-kis, CDobos, JDen Blaauwen, T Styryl quinazoline derivatives as pharmaceutically active agents US Patent US9951029 Publication Date 4/24/2018
 
Receptor-type tyrosine-protein kinase FLT3
Name:Receptor-type tyrosine-protein kinase FLT3
Type:Enzyme
Mol. Mass.:112888.62
Organism:Homo sapiens (Human)
Description:P36888
Residue:993
BDBM389575
NameBDBM389575
Synonyms:N,N-diethyl-N'-{2-[(E)-2-(4- fluorophenyl)vinyl]quinazolin-4- yl}ethane-1,2-diamine | US9951029, 69
TypeSmall organic molecule
Emp. Form.C22H25FN4
Mol. Mass.364.4591
SMILESCCN(CC)CCNc1nc(\C=C\c2ccc(F)cc2)nc2ccccc12