Reaction Details
TargetReceptor-type tyrosine-protein kinase FLT3
LigandBDBM389581
Substrate/Competitorn/a
Meas. Tech.Biochemical Activity Assay
IC50 1703±n/a nM
Citation Baska, FKéri, GOrfi, LBánhegyi, PKékesi, LZsákai, LSipos, ASzántai-kis, CDobos, JDen Blaauwen, T Styryl quinazoline derivatives as pharmaceutically active agents US Patent US9951029 Publication Date 4/24/2018
 
Receptor-type tyrosine-protein kinase FLT3
Name:Receptor-type tyrosine-protein kinase FLT3
Type:Enzyme
Mol. Mass.:112888.62
Organism:Homo sapiens (Human)
Description:P36888
Residue:993
BDBM389581
NameBDBM389581
Synonyms:N'-{6-chloro-2-[(E)-2-(3,4- difluorophenyl)vinyl]quinazolin-4- yl}-N,N-dimethylethane-1,2-diamine | US9951029, 81
TypeSmall organic molecule
Emp. Form.C20H19ClF2N4
Mol. Mass.388.841
SMILESCN(C)CCNc1nc(\C=C\c2ccc(F)c(F)c2)nc2ccc(Cl)cc12