Reaction Details
TargetReceptor-type tyrosine-protein kinase FLT3
LigandBDBM389583
Substrate/Competitorn/a
Meas. Tech.Biochemical Activity Assay
IC50 134±n/a nM
Citation Baska, FKéri, GOrfi, LBánhegyi, PKékesi, LZsákai, LSipos, ASzántai-kis, CDobos, JDen Blaauwen, T Styryl quinazoline derivatives as pharmaceutically active agents US Patent US9951029 Publication Date 4/24/2018
 
Receptor-type tyrosine-protein kinase FLT3
Name:Receptor-type tyrosine-protein kinase FLT3
Type:Enzyme
Mol. Mass.:112888.62
Organism:Homo sapiens (Human)
Description:P36888
Residue:993
BDBM389583
NameBDBM389583
Synonyms:N-{2-[(E)-2-(4- methoxyphenyl)vinyl]quinazolin-4- yl}propane-1,3-diamine | US9951029, 83
TypeSmall organic molecule
Emp. Form.C20H22N4O
Mol. Mass.334.4149
SMILESCOc1ccc(\C=C\c2nc(NCCCN)c3ccccc3n2)cc1