Reaction Details
TargetReceptor-type tyrosine-protein kinase FLT3
LigandBDBM389594
Substrate/Competitorn/a
Meas. Tech.Biochemical Activity Assay
IC50 2931±n/a nM
Citation Baska, FKéri, GOrfi, LBánhegyi, PKékesi, LZsákai, LSipos, ASzántai-kis, CDobos, JDen Blaauwen, T Styryl quinazoline derivatives as pharmaceutically active agents US Patent US9951029 Publication Date 4/24/2018
 
Receptor-type tyrosine-protein kinase FLT3
Name:Receptor-type tyrosine-protein kinase FLT3
Type:Enzyme
Mol. Mass.:112888.62
Organism:Homo sapiens (Human)
Description:P36888
Residue:993
BDBM389594
NameBDBM389594
Synonyms:N'-{6-chloro-2-[(E)-2-(2- thienyl)vinyl]quinazolin-4-yl}-N,N- dimethylethane-1,2-diamine | US9951029, 103
TypeSmall organic molecule
Emp. Form.C18H19ClN4S
Mol. Mass.358.888
SMILESCN(C)CCNc1nc(\C=C\c2cccs2)nc2ccc(Cl)cc12