Reaction Details
TargetReceptor-type tyrosine-protein kinase FLT3
LigandBDBM389602
Substrate/Competitorn/a
Meas. Tech.Biochemical Activity Assay
IC50 1264±n/a nM
Citation Baska, FKéri, GOrfi, LBánhegyi, PKékesi, LZsákai, LSipos, ASzántai-kis, CDobos, JDen Blaauwen, T Styryl quinazoline derivatives as pharmaceutically active agents US Patent US9951029 Publication Date 4/24/2018
 
Receptor-type tyrosine-protein kinase FLT3
Name:Receptor-type tyrosine-protein kinase FLT3
Type:Enzyme
Mol. Mass.:112888.62
Organism:Homo sapiens (Human)
Description:P36888
Residue:993
BDBM389602
NameBDBM389602
Synonyms:N'-(6-chloro-2-{(E)-2-[4- (methylthio)phenyl]vinyl}quinazolin- 4-yl)-N,N-dimethylethane-1,2- diamine | US9951029, 112
TypeSmall organic molecule
Emp. Form.C21H23ClN4S
Mol. Mass.398.952
SMILESCSc1ccc(\C=C\c2nc(NCCN(C)C)c3cc(Cl)ccc3n2)cc1