Reaction Details
TargetReceptor-type tyrosine-protein kinase FLT3
LigandBDBM389604
Substrate/Competitorn/a
Meas. Tech.Biochemical Activity Assay
IC50 326±n/a nM
Citation Baska, FKéri, GOrfi, LBánhegyi, PKékesi, LZsákai, LSipos, ASzántai-kis, CDobos, JDen Blaauwen, T Styryl quinazoline derivatives as pharmaceutically active agents US Patent US9951029 Publication Date 4/24/2018
 
Receptor-type tyrosine-protein kinase FLT3
Name:Receptor-type tyrosine-protein kinase FLT3
Type:Enzyme
Mol. Mass.:112888.62
Organism:Homo sapiens (Human)
Description:P36888
Residue:993
BDBM389604
NameBDBM389604
Synonyms:N,N-dimethyl-N'-(2-{(E)-2-[4- (methylsulfonyl)phenyl]vinyl}quinazolin- 4-yl)ethane-1,2-diamine | US9951029, 121
TypeSmall organic molecule
Emp. Form.C21H24N4O2S
Mol. Mass.396.506
SMILESCN(C)CCNc1nc(\C=C\c2ccc(cc2)S(C)(=O)=O)nc2ccccc12