Reaction Details
TargetReceptor-type tyrosine-protein kinase FLT3
LigandBDBM389609
Substrate/Competitorn/a
Meas. Tech.Biochemical Activity Assay
IC50 1404±n/a nM
Citation Baska, FKéri, GOrfi, LBánhegyi, PKékesi, LZsákai, LSipos, ASzántai-kis, CDobos, JDen Blaauwen, T Styryl quinazoline derivatives as pharmaceutically active agents US Patent US9951029 Publication Date 4/24/2018
 
Receptor-type tyrosine-protein kinase FLT3
Name:Receptor-type tyrosine-protein kinase FLT3
Type:Enzyme
Mol. Mass.:112888.62
Organism:Homo sapiens (Human)
Description:P36888
Residue:993
BDBM389609
NameBDBM389609
Synonyms:N'-{6-chloro-2-[(E)-2-(4- isopropylphenyl)vinyl]quinazolin-4- yl}-N,N-diethylethane-1,2-diamine | US9951029, 126
TypeSmall organic molecule
Emp. Form.C25H31ClN4
Mol. Mass.422.993
SMILESCCN(CC)CCNc1nc(\C=C\c2ccc(cc2)C(C)C)nc2ccc(Cl)cc12