Reaction Details
TargetPoly [ADP-ribose] polymerase 1
LigandBDBM27497
Substrate/CompetitorBDBM27089
Meas. Tech.Scintillation Proximity Assay (SPA)
pH7.8±n/a
Temperature295.15±n/a K
IC50 19±3 nM
Citation Eltze, TBoer, RWagner, TWeinbrenner, SMcDonald, MCThiemermann, CBürkle, AKlein, T Imidazoquinolinone, imidazopyridine, and isoquinolindione derivatives as novel and potent inhibitors of the poly(ADP-ribose) polymerase (PARP): a comparison with standard PARP inhibitors. Mol Pharmacol74:1587-98 (2008) 
 
Poly [ADP-ribose] polymerase 1
Name:Poly [ADP-ribose] polymerase 1
Type:n/a
Mol. Mass.:113114.22
Organism:Homo sapiens (Human)
Description:P09874
Residue:1014
BDBM27497
BDBM27089
NameBDBM27497
Synonyms:2-(dimethylamino)-N-(6-oxo-5,6-dihydrophenanthridin-2-yl)acetamide CHEMBL372303 N~2~,N~2~-DIMETHYL-N~1~-(6-OXO-5,6-DIHYDROPHENANTHRIDIN-2-YL)GLYCINAMIDE | PJ34
TypeSmall organic molecule
Emp. Form.C17H17N3O2
Mol. Mass.295.3358
SMILESCN(C)CC(=O)Nc1ccc2[nH]c(=O)c3ccccc3c2c1