Reaction Details
TargetPoly [ADP-ribose] polymerase 2
LigandBDBM27504
Substrate/CompetitorBDBM27089
Meas. Tech.Scintillation Proximity Assay (SPA)
pH7.8±n/a
Temperature295.15±n/a K
IC50 25704±4811 nM
Citation Eltze, TBoer, RWagner, TWeinbrenner, SMcDonald, MCThiemermann, CBürkle, AKlein, T Imidazoquinolinone, imidazopyridine, and isoquinolindione derivatives as novel and potent inhibitors of the poly(ADP-ribose) polymerase (PARP): a comparison with standard PARP inhibitors. Mol Pharmacol74:1587-98 (2008) 
 
Poly [ADP-ribose] polymerase 2
Name:Poly [ADP-ribose] polymerase 2
Type:n/a
Mol. Mass.:63409.97
Organism:Mus musculus (Mouse)
Description:Alexis Biochemicals, Cat. no. ALX-201-064-C020
Residue:559
BDBM27504
BDBM27089
NameBDBM27504
Synonyms:4-HQN CHEMBL266540 | quinazolin-4-ol
TypeSmall organic molecule
Emp. Form.C8H6N2O
Mol. Mass.146.146
SMILESO=c1[nH]cnc2ccccc12