Reaction Details
TargetMitogen-activated protein kinase 10
LigandBDBM27783
Substrate/CompetitorBDBM27807
Meas. Tech.Fluorescence Anisotropy Competitive Binding Assay
pH7.5±n/a
Temperature295.15±n/a K
IC50 100±n/a nM
Citation Chamberlain, SDRedman, AMWilson, JWDeanda, FShotwell, JBGerding, RLei, HYang, BStevens, KLHassell, AMShewchuk, LMLeesnitzer, MASmith, JLSabbatini, PAtkins, CGroy, ARowand, JLKumar, RMook, RAMoorthy, GPatnaik, S Optimization of 4,6-bis-anilino-1H-pyrrolo[2,3-d]pyrimidine IGF-1R tyrosine kinase inhibitors towards JNK selectivity. Bioorg Med Chem Lett19:360-4 (2009) 
 
Mitogen-activated protein kinase 10
Name:Mitogen-activated protein kinase 10
Type:Enzyme
Mol. Mass.:52586.89
Organism:Homo sapiens (Human)
Description:n/a
Residue:464
BDBM27783
BDBM27807
NameBDBM27783
Synonyms:2-fluoro-6-{[2-({2-methoxy-4-[4-(propan-2-yl)piperazin-1-yl]phenyl}amino)-7H-pyrrolo[2,3-d]pyrimidin-4-yl]amino}benzamide CHEMBL507625 | pyrrolo[2,3-d]pyrimidine deriv., 1
TypeSmall organic molecule
Emp. Form.C27H31FN8O2
Mol. Mass.518.5858
SMILESCOc1cc(ccc1Nc1nc(Nc2cccc(F)c2C(N)=O)c2cc[nH]c2n1)N1CCN(CC1)C(C)C