Reaction Details
TargetDiacylglycerol O-acyltransferase 1
LigandBDBM27947
Substrate/CompetitorBDBM27948
Meas. Tech.DGAT Enzyme Inhibition Assay
pH7.4±n/a
Temperature295.15±n/a K
IC50 15±n/a nM
Citation Birch, AMBirtles, SBuckett, LKKemmitt, PDSmith, GJSmith, TJTurnbull, AVWang, SJ Discovery of a potent, selective, and orally efficacious pyrimidinooxazinyl bicyclooctaneacetic acid diacylglycerol acyltransferase-1 inhibitor. J Med Chem52:1558-68 (2009) 
 
Diacylglycerol O-acyltransferase 1
Name:Diacylglycerol O-acyltransferase 1
Type:Protein
Mol. Mass.:55297.82
Organism:Homo sapiens (Human)
Description:O75907
Residue:488
BDBM27947
BDBM27948
NameBDBM27947
Synonyms:2-[4-(4-{4-amino-7,7-dimethyl-7H-pyrimido[4,5-b][1,4]oxazin-6-yl}phenyl)cyclohexyl]acetic acid | pyrimido[4,5-b][1,4]oxazine derivative, 2
TypeSmall organic molecule
Emp. Form.C22H26N4O3
Mol. Mass.394.4668
SMILESCC1(C)Oc2ncnc(N)c2N=C1c1ccc(cc1)[C@H]1CC[C@H](CC(O)=O)CC1