Reaction Details
TargetDihydroorotate dehydrogenase (quinone), mitochondrial
LigandBDBM29034
Substrate/CompetitorBDBM14700
Meas. Tech.DHODH Inhibition Assay
Ki 2.7±n/a nM
IC50 22±n/a nM
Citation Davies, MHeikkilä, TMcConkey, GAFishwick, CWParsons, MRJohnson, AP Structure-based design, synthesis, and characterization of inhibitors of human and Plasmodium falciparum dihydroorotate dehydrogenases. J Med Chem52:2683-93 (2009) 
 
Dihydroorotate dehydrogenase (quinone), mitochondrial
Name:Dihydroorotate dehydrogenase (quinone), mitochondrial
Type:Enzyme
Mol. Mass.:42881.33
Organism:Homo sapiens (Human)
Description:Q02127
Residue:395
BDBM29034
BDBM14700
NameBDBM29034
Synonyms:cyanohydroxybutenamide, 24
TypeSmall organic molecule
Emp. Form.C17H12Cl2N2O2
Mol. Mass.347.195
SMILESCC(=O)C(C#N)C(=O)Nc1ccc(c(Cl)c1)-c1ccccc1Cl