Reaction Details
TargetCannabinoid receptor 1
LigandBDBM29085
Substrate/CompetitorBDBM21244
Meas. Tech.CB Receptor Radioligand Binding Assay (Ki)
pH7.4±n/a
Temperature303.15±n/a K
Ki>10000±n/a nM
Citation Appendino, GLigresti, AMinassi, ACascio, MGAllarà, MTaglialatela-Scafati, OPertwee, RGDe Petrocellis, LDi Marzo, V Conformationally constrained fatty acid ethanolamides as cannabinoid and vanilloid receptor probes. J Med Chem52:3001-9 (2009) 
 
Cannabinoid receptor 1
Name:Cannabinoid receptor 1
Type:G Protein-Coupled Receptor (GPCR)
Mol. Mass.:52868.96
Organism:Homo sapiens (Human)
Description:P21554
Residue:472
BDBM29085
BDBM21244
NameBDBM29085
Synonyms:cyclopropanolamide, rac-9c
TypeSmall organic molecule
Emp. Form.C19H37NO2
Mol. Mass.311.5026
(=O)N[C@@H]1C[C@H]1O